Reaction Details
TargetMetabotropic glutamate receptor 6
LigandBDBM50031704
Substrate/Competitorn/a
Meas. Tech.ChEMBL_591059 (CHEMBL1052812)
IC50 4000±n/a nM
Citation Briel, DRybak, AKronbach, CUnverferth, K Substituted 2-aminothiopen-derivatives: a potential new class of GluR6-antagonists. Eur J Med Chem45:69-77 (2010) 
 
Metabotropic glutamate receptor 6
Name:Metabotropic glutamate receptor 6
Type:Enzyme Catalytic Domain
Mol. Mass.:95479.26
Organism:Homo sapiens (Human)
Description:metabotropic glutamate 6 GRM6 HUMAN::O15303
Residue:877
BDBM50031704
NameBDBM50031704
Synonyms:(2S,4R)-2-Amino-4-methyl-pentanedioic acid (2S,4R)-4-methylglutamic acid CHEMBL288166
TypeSmall organic molecule
Emp. Form.C6H11NO4
Mol. Mass.161.1558
SMILESC[C@H](C[C@H](N)C(O)=O)C(O)=O