Reaction Details
TargetExtracellular calcium-sensing receptor
LigandBDBM50299545
Substrate/Competitorn/a
Meas. Tech.ChEMBL_591453 (CHEMBL1055305)
IC50>25±n/a nM
Citation Marquis, RWLago, AMCallahan, JFRahman, ADong, XStroup, GBHoffman, SGowen, MDelMar, EGVan Wagenen, BCLogan, SShimizu, SFox, JNemeth, EFRoethke, TSmith, BRWard, KWBhatnagar, P Antagonists of the calcium receptor. 2. Amino alcohol-based parathyroid hormone secretagogues. J Med Chem52:6599-605 (2009) 
 
Extracellular calcium-sensing receptor
Name:Extracellular calcium-sensing receptor
Type:Protein
Mol. Mass.:120663.13
Organism:Homo sapiens (Human)
Description:P41180
Residue:1078
BDBM50299545
NameBDBM50299545
Synonyms:3-{4-[((2R)-3-{[1,1-Dimethyl-2-(2-naphthalenyl)ethyl]amino}-2-hydroxypropyl)oxy]phenyl}propanoic Acid | CHEMBL572163
TypeSmall organic molecule
Emp. Form.C26H31NO4
Mol. Mass.421.5286
SMILESCC(C)(Cc1ccc2ccccc2c1)NC[C@@H](O)COc1ccc(CCC(O)=O)cc1