Reaction Details
TargetSodium-dependent noradrenaline transporter
LigandBDBM50378146
Substrate/Competitorn/a
Meas. Tech.ChEMBL_591455 (CHEMBL1055307)
IC50 37.0±n/a nM
Citation Marquis, RWLago, AMCallahan, JFRahman, ADong, XStroup, GBHoffman, SGowen, MDelMar, EGVan Wagenen, BCLogan, SShimizu, SFox, JNemeth, EFRoethke, TSmith, BRWard, KWBhatnagar, P Antagonists of the calcium receptor. 2. Amino alcohol-based parathyroid hormone secretagogues. J Med Chem52:6599-605 (2009) 
 
Sodium-dependent noradrenaline transporter
Name:Sodium-dependent noradrenaline transporter
Type:Multi-pass membrane protein
Mol. Mass.:69337.72
Organism:Homo sapiens (Human)
Description:P23975
Residue:617
BDBM50378146
NameBDBM50378146
Synonyms:CHEMBL1204009
TypeSmall organic molecule
Emp. Form.C29H34N2O4
Mol. Mass.474.5913
SMILESCCOC(=O)CCc1ccc(OC[C@H](O)CNC(C)(C)Cc2ccc3ccccc3c2)c(c1)C#N