Reaction Details
TargetSigma non-opioid intracellular receptor 1
LigandBDBM81982
Substrate/Competitorn/a
Meas. Tech.ChEMBL_588703 (CHEMBL1059312)
Ki 88.5±n/a nM
Citation Berardi, FAbate, CFerorelli, SUricchio, VColabufo, NANiso, MPerrone, R Exploring the importance of piperazine N-atoms for sigma(2) receptor affinity and activity in a series of analogs of 1-cyclohexyl-4-[3-(5-methoxy-1,2,3,4-tetrahydronaphthalen-1-yl)propyl]piperazine (PB28). J Med Chem52:7817-28 (2009) 
 
Sigma non-opioid intracellular receptor 1
Name:Sigma non-opioid intracellular receptor 1
Type:Enzyme Catalytic Domain
Mol. Mass.:25266.54
Organism:RAT
Description:Q9R0C9
Residue:223
BDBM81982
NameBDBM81982
Synonyms:CAS_97-39-2 DTG Tol2Gdn | cid_7333
TypeSmall organic molecule
Emp. Form.C15H17N3
Mol. Mass.239.3156
SMILESCc1ccccc1NC(N)=Nc1ccccc1C