Reaction Details
TargetSigma non-opioid intracellular receptor 1
LigandBDBM50299711
Substrate/Competitorn/a
Meas. Tech.ChEMBL_588694 (CHEMBL1056845)
Ki 0.11±n/a nM
Citation Berardi, FAbate, CFerorelli, SUricchio, VColabufo, NANiso, MPerrone, R Exploring the importance of piperazine N-atoms for sigma(2) receptor affinity and activity in a series of analogs of 1-cyclohexyl-4-[3-(5-methoxy-1,2,3,4-tetrahydronaphthalen-1-yl)propyl]piperazine (PB28). J Med Chem52:7817-28 (2009) 
 
Sigma non-opioid intracellular receptor 1
Name:Sigma non-opioid intracellular receptor 1
Type:Protein
Mol. Mass.:25307.17
Organism:Cavia porcellus (Guinea pig)
Description:Q60492
Residue:223
BDBM50299711
NameBDBM50299711
Synonyms:4-Cyclohexyl-1-[3-(5-methoxy-1,2,3,4-tetrahydronaphthalen-1-yl)propionyl]piperazine | CHEMBL573234
TypeSmall organic molecule
Emp. Form.C24H36N2O2
Mol. Mass.384.5548
SMILESCOc1cccc2C(CCC(=O)N3CCN(CC3)C3CCCCC3)CCCc12