Reaction Details
TargetCarbonic anhydrase 2
LigandBDBM10869
Substrate/Competitorn/a
Meas. Tech.ChEMBL_588927 (CHEMBL1063842)
Ki 19±n/a nM
Citation Carta, FMaresca, ACovarrubias, ASMowbray, SLJones, TASupuran, CT Carbonic anhydrase inhibitors. Characterization and inhibition studies of the most active beta-carbonic anhydrase from Mycobacterium tuberculosis, Rv3588c. Bioorg Med Chem Lett19:6649-54 (2009) 
 
Carbonic anhydrase 2
Name:Carbonic anhydrase 2
Type:Enzyme
Mol. Mass.:29250.71
Organism:Homo sapiens (Human)
Description:P00918
Residue:260
BDBM10869
NameBDBM10869
Synonyms:5-imino-4-methyl-4,5-dihydro-1,3,4-thiadiazole-2-sulfonamide aromatic/heteroaromatic sulfonamide 14
TypeSmall organic molecule
Emp. Form.C3H6N4O2S2
Mol. Mass.194.235
SMILESCn1nc(sc1=N)S(N)(=O)=O