Reaction Details
TargetCarbonic anhydrase 2
LigandBDBM10877
Substrate/Competitorn/a
Meas. Tech.ChEMBL_588928 (CHEMBL1063843)
Ki 34500±n/a nM
Citation Carta, FMaresca, ACovarrubias, ASMowbray, SLJones, TASupuran, CT Carbonic anhydrase inhibitors. Characterization and inhibition studies of the most active beta-carbonic anhydrase from Mycobacterium tuberculosis, Rv3588c. Bioorg Med Chem Lett19:6649-54 (2009) 
 
Carbonic anhydrase 2
Name:Carbonic anhydrase 2
Type:Enzyme
Mol. Mass.:21788.97
Organism:Mycobacterium tuberculosis
Description:P9WPJ9
Residue:207
BDBM10877
NameBDBM10877
Synonyms:4-(2-hydroxyethyl)benzene-1-sulfonamide JMC522226 Compound 21 aromatic/heteroaromatic sulfonamide 22
TypeSmall organic molecule
Emp. Form.C8H11NO3S
Mol. Mass.201.243
SMILESNS(=O)(=O)c1ccc(CCO)cc1