Reaction Details
TargetLegumain
LigandBDBM50378258
Substrate/Competitorn/a
Meas. Tech.ChEMBL_589116 (CHEMBL1038469)
IC50 2.4±n/a nM
Citation Ovat, AMuindi, FFagan, CBrouner, MHansell, EDvorák, JSojka, DKopácek, PMcKerrow, JHCaffrey, CRPowers, JC Aza-peptidyl Michael acceptor and epoxide inhibitors--potent and selective inhibitors of Schistosoma mansoni and Ixodes ricinus legumains (asparaginyl endopeptidases). J Med Chem52:7192-210 (2009) 
 
Legumain
Name:Legumain
Type:Enzyme
Mol. Mass.:49038.15
Organism:Ixodes ricinus
Description:IrAE was expressed and produced in Pichia pastoris.
Residue:441
BDBM50378258
NameBDBM50378258
Synonyms:CHEMBL573249
TypeSmall organic molecule
Emp. Form.C36H41N7O7
Mol. Mass.683.7534
SMILESC[C@H](NC(=O)[C@H](C)NC(=O)N1CCCCC1)C(=O)NN(CC(N)=O)C(=O)C=CC(=O)N(Cc1cccc2ccccc12)C(=O)c1ccccc1