Reaction Details
TargetHepatocyte growth factor receptor
LigandBDBM50299771
Substrate/Competitorn/a
Meas. Tech.ChEMBL_589181 (CHEMBL1040332)
IC50 20±n/a nM
Citation Mannion, MRaeppel, SClaridge, SZhou, NSaavedra, OIsakovic, LZhan, LGaudette, FRaeppel, FDéziel, RBeaulieu, NNguyen, HChute, IBeaulieu, CDupont, IRobert, MFLefebvre, SDubay, MRahil, JWang, JSte-Croix, HRobert Macleod, ABesterman, JMVaisburg, A N-(4-(6,7-Disubstituted-quinolin-4-yloxy)-3-fluorophenyl)-2-oxo-3-phenylimidazolidine-1-carboxamides: a novel series of dual c-Met/VEGFR2 receptor tyrosine kinase inhibitors. Bioorg Med Chem Lett19:6552-6 (2009) 
 
Hepatocyte growth factor receptor
Name:Hepatocyte growth factor receptor
Type:Protein
Mol. Mass.:155559.73
Organism:Homo sapiens (Human)
Description:P08581
Residue:1390
BDBM50299771
NameBDBM50299771
Synonyms:CHEMBL574093 | N-(4-(6,7-bis(2-methoxyethoxy)quinolin-4-yloxy)-3-fluorophenyl)-2-oxo-3-phenylimidazolidine-1-carboxamide
TypeSmall organic molecule
Emp. Form.C31H31FN4O7
Mol. Mass.590.5988
SMILESCOCCOc1cc2nccc(Oc3ccc(NC(=O)N4CCN(C4=O)c4ccccc4)cc3F)c2cc1OCCOC