Reaction Details
TargetIntegrin alpha-IIb/beta-3
LigandBDBM50378331
Substrate/Competitorn/a
Meas. Tech.ChEMBL_589622 (CHEMBL1052175)
IC50 121±n/a nM
Citation Rerat, VDive, GCordi, AATucker, GCBareille, RAmédée, JBordenave, LMarchand-Brynaert, J alphavbeta3 Integrin-targeting Arg-Gly-Asp (RGD) peptidomimetics containing oligoethylene glycol (OEG) spacers. J Med Chem52:7029-43 (2009) 
 
Integrin alpha-IIb/beta-3
Name:Integrin alpha-IIb/beta-3
Synonyms:Glycoprotein IIb/IIIa
Type:n/a
Mol. Mass.:n/a
Description:ASSAY_ID of EBI is 30109
Components:This complex has 2 components.
Component 1
Name:Integrin beta-3
Type:Protein
Mol. Mass.:87038.91
Organism:Homo sapiens (Human)
Description:P05106
Residue:788
Component 2
Name:Integrin alpha-IIb
Synonyms:CD_antigen=CD41 GPIIb Glycoprotein IIb ITGA2B Integrin alpha-IIb heavy chain Integrin alpha-IIb light chain, form 2 Integrin alpha-V/beta-3 and alpha-IIb/beta 3 | Platelet membrane glycoprotein IIb
Type:Protein
Mol. Mass.:113354.85
Organism:Homo sapiens (Human)
Description:P08514
Residue:1039
BDBM50378331
NameBDBM50378331
Synonyms:CHEMBL566785
TypeSmall organic molecule
Emp. Form.C26H29F3N4O5S
Mol. Mass.566.592
SMILESCc1cccc(NCCCCOc2ccc(C[C@H](NS(=O)(=O)c3cccc(c3)C(F)(F)F)C(O)=O)cc2N)n1