Reaction Details
TargetIntegrin alpha-V/beta-3
LigandBDBM50378330
Substrate/Competitorn/a
Meas. Tech.ChEMBL_589621 (CHEMBL1052174)
IC50 0.5±n/a nM
Citation Rerat, VDive, GCordi, AATucker, GCBareille, RAmédée, JBordenave, LMarchand-Brynaert, J alphavbeta3 Integrin-targeting Arg-Gly-Asp (RGD) peptidomimetics containing oligoethylene glycol (OEG) spacers. J Med Chem52:7029-43 (2009) 
 
Integrin alpha-V/beta-3
Name:Integrin alpha-V/beta-3
Type:Enzyme
Mol. Mass.:n/a
Description:n/a
Components:This complex has 2 components.
Component 1
Name:Integrin alpha-V
Synonyms:ITAV_HUMAN Integrin alpha-V/alpha-5 VNRA Vitronectin receptor | Vitronectin receptor subunit alpha
Type:PROTEIN
Mol. Mass.:116024.92
Organism:Homo sapiens (Human)
Description:ChEMBL_582336
Residue:1048
Component 2
Name:Integrin beta-3
Synonyms:CD_antigen=CD61 GPIIIa ITGB3 Platelet membrane glycoprotein IIIa
Type:Protein
Mol. Mass.:87038.91
Organism:Homo sapiens (Human)
Description:P05106
Residue:788
BDBM50378330
NameBDBM50378330
Synonyms:CHEMBL583966
TypeSmall organic molecule
Emp. Form.C35H45F3N4O10S
Mol. Mass.770.813
SMILESCOCCOCCOCCOCC(=O)Nc1cc(C[C@H](NS(=O)(=O)c2cccc(c2)C(F)(F)F)C(O)=O)ccc1OCCCCNc1cc(C)ccn1