Reaction Details
TargetIntegrin alpha-V/beta-3
LigandBDBM50414896
Substrate/Competitorn/a
Meas. Tech.ChEMBL_589621 (CHEMBL1052174)
IC50 750±n/a nM
Citation Rerat, VDive, GCordi, AATucker, GCBareille, RAmédée, JBordenave, LMarchand-Brynaert, J alphavbeta3 Integrin-targeting Arg-Gly-Asp (RGD) peptidomimetics containing oligoethylene glycol (OEG) spacers. J Med Chem52:7029-43 (2009) 
 
Integrin alpha-V/beta-3
Name:Integrin alpha-V/beta-3
Type:Enzyme
Mol. Mass.:n/a
Description:n/a
Components:This complex has 2 components.
Component 1
Name:Integrin alpha-V
Synonyms:ITAV_HUMAN Integrin alpha-V/alpha-5 VNRA Vitronectin receptor | Vitronectin receptor subunit alpha
Type:PROTEIN
Mol. Mass.:116024.92
Organism:Homo sapiens (Human)
Description:ChEMBL_582336
Residue:1048
Component 2
Name:Integrin beta-3
Synonyms:CD_antigen=CD61 GPIIIa ITGB3 Platelet membrane glycoprotein IIIa
Type:Protein
Mol. Mass.:87038.91
Organism:Homo sapiens (Human)
Description:P05106
Residue:788
BDBM50414896
NameBDBM50414896
Synonyms:CHEMBL417553
TypeSmall organic molecule
Emp. Form.C17H30N8O9
Mol. Mass.490.4683
SMILES[#7]-[#6]-[#6](=O)-[#7]-[#6@@H](-[#6]-[#6]-[#6]\[#7]=[#6](/[#7])-[#7])-[#6](=O)-[#7]-[#6]-[#6](=O)-[#7]-[#6@@H](-[#6]-[#6](-[#8])=O)-[#6](=O)-[#7]-[#6@@H](-[#6]-[#8])-[#6](-[#8])=O