Reaction Details
TargetMalate dehydrogenase, mitochondrial
LigandBDBM50300047
Substrate/Competitorn/a
Meas. Tech.ChEMBL_593431 (CHEMBL1041437)
IC50 9900±n/a nM
Citation Becker, AKohfeld, SLader, APreu, LPies, TWieking, KFerandin, YKnockaert, MMeijer, LKunick, C Development of 5-benzylpaullones and paullone-9-carboxylic acid alkyl esters as selective inhibitors of mitochondrial malate dehydrogenase (mMDH). Eur J Med Chem45:335-42 (2010) 
 
Malate dehydrogenase, mitochondrial
Name:Malate dehydrogenase, mitochondrial
Type:PROTEIN
Mol. Mass.:35512.45
Organism:Homo sapiens (Human)
Description:ChEMBL_1456625
Residue:338
BDBM50300047
NameBDBM50300047
Synonyms:Butyl 6-oxo-5,6,7,12-tetrahydroindolo[3,2-d][1]benzazepine-9-carboxylate | CHEMBL565663
TypeSmall organic molecule
Emp. Form.C21H20N2O3
Mol. Mass.348.3951
SMILESCCCCOC(=O)c1ccc2[nH]c-3c(CC(=O)Nc4ccccc-34)c2c1