Reaction Details
TargetMalate dehydrogenase, mitochondrial
LigandBDBM50300053
Substrate/Competitorn/a
Meas. Tech.ChEMBL_593431 (CHEMBL1041437)
IC50 1100±n/a nM
Citation Becker, AKohfeld, SLader, APreu, LPies, TWieking, KFerandin, YKnockaert, MMeijer, LKunick, C Development of 5-benzylpaullones and paullone-9-carboxylic acid alkyl esters as selective inhibitors of mitochondrial malate dehydrogenase (mMDH). Eur J Med Chem45:335-42 (2010) 
 
Malate dehydrogenase, mitochondrial
Name:Malate dehydrogenase, mitochondrial
Type:PROTEIN
Mol. Mass.:35512.45
Organism:Homo sapiens (Human)
Description:ChEMBL_1456625
Residue:338
BDBM50300053
NameBDBM50300053
Synonyms:9-Bromo-5-(3,4-dichlorobenzyl)-7,12-dihydroindolo[3,2-d][1]benzazepin-6(5H)-one | CHEMBL577566
TypeSmall organic molecule
Emp. Form.C23H15BrCl2N2O
Mol. Mass.486.188
SMILESClc1ccc(CN2c3ccccc3-c3[nH]c4ccc(Br)cc4c3CC2=O)cc1Cl