Reaction Details
TargetMalate dehydrogenase, mitochondrial
LigandBDBM50300058
Substrate/Competitorn/a
Meas. Tech.ChEMBL_593431 (CHEMBL1041437)
IC50 4200±n/a nM
Citation Becker, AKohfeld, SLader, APreu, LPies, TWieking, KFerandin, YKnockaert, MMeijer, LKunick, C Development of 5-benzylpaullones and paullone-9-carboxylic acid alkyl esters as selective inhibitors of mitochondrial malate dehydrogenase (mMDH). Eur J Med Chem45:335-42 (2010) 
 
Malate dehydrogenase, mitochondrial
Name:Malate dehydrogenase, mitochondrial
Type:PROTEIN
Mol. Mass.:35512.45
Organism:Homo sapiens (Human)
Description:ChEMBL_1456625
Residue:338
BDBM50300058
NameBDBM50300058
Synonyms:5-Benzyl-9-trifluoromethyl-7,12-dihydroindolo[3,2-d][1]benzazepin-6(5H)-one | CHEMBL574918
TypeSmall organic molecule
Emp. Form.C24H17F3N2O
Mol. Mass.406.3998
SMILESFC(F)(F)c1ccc2[nH]c-3c(CC(=O)N(Cc4ccccc4)c4ccccc-34)c2c1