Reaction Details
TargetMalate dehydrogenase, mitochondrial
LigandBDBM50300060
Substrate/Competitorn/a
Meas. Tech.ChEMBL_593431 (CHEMBL1041437)
IC50 2700±n/a nM
Citation Becker, AKohfeld, SLader, APreu, LPies, TWieking, KFerandin, YKnockaert, MMeijer, LKunick, C Development of 5-benzylpaullones and paullone-9-carboxylic acid alkyl esters as selective inhibitors of mitochondrial malate dehydrogenase (mMDH). Eur J Med Chem45:335-42 (2010) 
 
Malate dehydrogenase, mitochondrial
Name:Malate dehydrogenase, mitochondrial
Type:PROTEIN
Mol. Mass.:35512.45
Organism:Homo sapiens (Human)
Description:ChEMBL_1456625
Residue:338
BDBM50300060
NameBDBM50300060
Synonyms:5-Benzyl-9-chloro-7,12-dihydroindolo[3,2-d][1]benzazepin-6(5H)-one | CHEMBL574898
TypeSmall organic molecule
Emp. Form.C23H17ClN2O
Mol. Mass.372.847
SMILESClc1ccc2[nH]c-3c(CC(=O)N(Cc4ccccc4)c4ccccc-34)c2c1