Reaction Details
TargetMalate dehydrogenase, mitochondrial
LigandBDBM7307
Substrate/Competitorn/a
Meas. Tech.ChEMBL_593431 (CHEMBL1041437)
IC50 2400±n/a nM
Citation Becker, AKohfeld, SLader, APreu, LPies, TWieking, KFerandin, YKnockaert, MMeijer, LKunick, C Development of 5-benzylpaullones and paullone-9-carboxylic acid alkyl esters as selective inhibitors of mitochondrial malate dehydrogenase (mMDH). Eur J Med Chem45:335-42 (2010) 
 
Malate dehydrogenase, mitochondrial
Name:Malate dehydrogenase, mitochondrial
Type:PROTEIN
Mol. Mass.:35512.45
Organism:Homo sapiens (Human)
Description:ChEMBL_1456625
Residue:338
BDBM7307
NameBDBM7307
Synonyms:5-benzyl-9-bromopaullone CHEMBL99779 Paullone Analog 46
TypeSmall organic molecule
Emp. Form.C23H17BrN2O
Mol. Mass.417.298
SMILESBrc1ccc2[nH]c-3c(CC(=O)N(Cc4ccccc4)c4ccccc-34)c2c1