Reaction Details
TargetPolyphenol oxidase 2
LigandBDBM50206194
Substrate/Competitorn/a
Meas. Tech.ChEMBL_593679 (CHEMBL1044132)
Ki 125000±n/a nM
Citation Yi, WCao, RPeng, WWen, HYan, QZhou, BMa, LSong, H Synthesis and biological evaluation of novel 4-hydroxybenzaldehyde derivatives as tyrosinase inhibitors. Eur J Med Chem45:639-46 (2010) 
 
Polyphenol oxidase 2
Name:Polyphenol oxidase 2
Type:Protein
Mol. Mass.:63923.66
Organism:Agaricus bisporus (Common mushroom)
Description:O42713
Residue:556
BDBM50206194
NameBDBM50206194
Synonyms:CHEMBL394901 | methyl 2-(2-(4-formylphenoxy)acetamido)propanoate
TypeSmall organic molecule
Emp. Form.C13H15NO5
Mol. Mass.265.2619
SMILESCOC(=O)C(C)NC(=O)COc1ccc(C=O)cc1