Reaction Details
TargetCarbonic anhydrase 6
LigandBDBM50300203
Substrate/Competitorn/a
Meas. Tech.ChEMBL_592889 (CHEMBL1046634)
Ki 35700±n/a nM
Citation Temperini, CInnocenti, AScozzafava, AParkkila, SSupuran, CT The coumarin-binding site in carbonic anhydrase accommodates structurally diverse inhibitors: the antiepileptic lacosamide as an example and lead molecule for novel classes of carbonic anhydrase inhibitors. J Med Chem53:850-4 (2010) 
 
Carbonic anhydrase 6
Name:Carbonic anhydrase 6
Type:Enzyme
Mol. Mass.:35371.40
Organism:Homo sapiens (Human)
Description:P23280
Residue:308
BDBM50300203
NameBDBM50300203
Synonyms:(S)-6-(1-hydroxy-3-methylbutyl)-7-methoxy-2H-chromen-2-one CHEMBL572366
TypeSmall organic molecule
Emp. Form.C15H18O4
Mol. Mass.262.301
SMILESCOc1cc2oc(=O)ccc2cc1[C@@H](O)CC(C)C