Reaction Details
TargetCarbonic anhydrase 12
LigandBDBM50300203
Substrate/Competitorn/a
Meas. Tech.ChEMBL_592892 (CHEMBL1046637)
Ki 48600±n/a nM
Citation Temperini, CInnocenti, AScozzafava, AParkkila, SSupuran, CT The coumarin-binding site in carbonic anhydrase accommodates structurally diverse inhibitors: the antiepileptic lacosamide as an example and lead molecule for novel classes of carbonic anhydrase inhibitors. J Med Chem53:850-4 (2010) 
 
Carbonic anhydrase 12
Name:Carbonic anhydrase 12
Type:Enzyme
Mol. Mass.:39456.00
Organism:Homo sapiens (Human)
Description:Catalytic domain of human cloned isozyme was used in the assay
Residue:354
BDBM50300203
NameBDBM50300203
Synonyms:(S)-6-(1-hydroxy-3-methylbutyl)-7-methoxy-2H-chromen-2-one CHEMBL572366
TypeSmall organic molecule
Emp. Form.C15H18O4
Mol. Mass.262.301
SMILESCOc1cc2oc(=O)ccc2cc1[C@@H](O)CC(C)C