Reaction Details
Target5-hydroxytryptamine receptor 1A
LigandBDBM50300488
Substrate/Competitorn/a
Meas. Tech.ChEMBL_592301 (CHEMBL1046676)
Ki 0.5±n/a nM
Citation Lacivita, ELeopoldo, MMasotti, ACInglese, CBerardi, FPerrone, RGanguly, SJafurulla, MChattopadhyay, A Synthesis and characterization of environment-sensitive fluorescent ligands for human 5-HT1A receptors with 1-arylpiperazine structure. J Med Chem52:7892-6 (2009) 
 
5-hydroxytryptamine receptor 1A
Name:5-hydroxytryptamine receptor 1A
Type:n/a
Mol. Mass.:46122.49
Organism:Homo sapiens (Human)
Description:n/a
Residue:422
BDBM50300488
NameBDBM50300488
Synonyms:5-(Dimethylamino)-2-[4-[4-(2-methoxyphenyl)-1-piperazinyl]butyl]-1H-isoindole-1,3(2H)-dione | CHEMBL591189
TypeSmall organic molecule
Emp. Form.C25H32N4O3
Mol. Mass.436.5466
SMILESCOc1ccccc1N1CCN(CCCCN2C(=O)c3ccc(cc3C2=O)N(C)C)CC1