Reaction Details
Target5-hydroxytryptamine receptor 1A
LigandBDBM82517
Substrate/Competitorn/a
Meas. Tech.ChEMBL_592301 (CHEMBL1046676)
Ki 0.6±n/a nM
Citation Lacivita, ELeopoldo, MMasotti, ACInglese, CBerardi, FPerrone, RGanguly, SJafurulla, MChattopadhyay, A Synthesis and characterization of environment-sensitive fluorescent ligands for human 5-HT1A receptors with 1-arylpiperazine structure. J Med Chem52:7892-6 (2009) 
 
5-hydroxytryptamine receptor 1A
Name:5-hydroxytryptamine receptor 1A
Type:n/a
Mol. Mass.:46122.49
Organism:Homo sapiens (Human)
Description:n/a
Residue:422
BDBM82517
NameBDBM82517
Synonyms:2-{4-[4-(2-Methoxy-phenyl)-piperazin-1-yl]-butyl}-isoindole-1,3-dione CHEMBL126632 NAN-190 | NSC_107966
TypeSmall organic molecule
Emp. Form.C23H27N3O3
Mol. Mass.393.4788
SMILESCOc1ccccc1N1CCN(CCCCN2C(=O)c3ccccc3C2=O)CC1