Reaction Details
TargetPenicillin-binding protein 2X
LigandBDBM50300689
Substrate/Competitorn/a
Meas. Tech.ChEMBL_589475 (CHEMBL1053623)
IC50 336000±n/a nM
Citation Miguet, LZervosen, AGerards, TPasha, FALuxen, ADistèche-Nguyen, MThomas, A Discovery of new inhibitors of resistant Streptococcus pneumoniae penicillin binding protein (PBP) 2x by structure-based virtual screening. J Med Chem52:5926-36 (2009) 
 
Penicillin-binding protein 2X
Name:Penicillin-binding protein 2X
Type:PROTEIN
Mol. Mass.:82337.09
Organism:Streptococcus pneumoniae R6
Description:ChEMBL_822530
Residue:750
BDBM50300689
NameBDBM50300689
Synonyms:6-chloro-2-(3-(4-chloro-2-methylphenyl)ureido)-3-(4-chlorophenoxy)benzenesulfonic acid | CHEMBL575313
TypeSmall organic molecule
Emp. Form.C20H15Cl3N2O5S
Mol. Mass.501.768
SMILESCc1cc(Cl)ccc1NC(=O)Nc1c(Oc2ccc(Cl)cc2)ccc(Cl)c1S(O)(=O)=O