Reaction Details
Target72 kDa type IV collagenase
LigandBDBM50301110
Substrate/Competitorn/a
Meas. Tech.ChEMBL_598555 (CHEMBL1043547)
IC50 235±n/a nM
Citation Li, YLShi, EBurns, DLi, YCovington, MBPan, MScherle, PFriedman, SMetcalf, BYao, W Discovery of novel selective HER-2 sheddase inhibitors through optimization of P1 moiety. Bioorg Med Chem Lett19:5037-42 (2009) 
 
72 kDa type IV collagenase
Name:72 kDa type IV collagenase
Type:Enzyme
Mol. Mass.:73870.36
Organism:Homo sapiens (Human)
Description: P08253
Residue:660
BDBM50301110
NameBDBM50301110
Synonyms:(5S,6S)-5-(hydroxycarbamoyl)-6-(3-phenyl-2,5-dihydro-1H-pyrrole-1-carbonyl)piperidin-3-yl pyrrolidine-1-carboxylate | CHEMBL568346
TypeSmall organic molecule
Emp. Form.C22H28N4O5
Mol. Mass.428.4815
SMILESONC(=O)[C@H]1C[C@@H](CN[C@@H]1C(=O)N1CC=C(C1)c1ccccc1)OC(=O)N1CCCC1