Reaction Details
Target72 kDa type IV collagenase
LigandBDBM50378414
Substrate/Competitorn/a
Meas. Tech.ChEMBL_598555 (CHEMBL1043547)
IC50 506±n/a nM
Citation Li, YLShi, EBurns, DLi, YCovington, MBPan, MScherle, PFriedman, SMetcalf, BYao, W Discovery of novel selective HER-2 sheddase inhibitors through optimization of P1 moiety. Bioorg Med Chem Lett19:5037-42 (2009) 
 
72 kDa type IV collagenase
Name:72 kDa type IV collagenase
Type:Enzyme
Mol. Mass.:73870.36
Organism:Homo sapiens (Human)
Description: P08253
Residue:660
BDBM50378414
NameBDBM50378414
Synonyms:CHEMBL1204013
TypeSmall organic molecule
Emp. Form.C22H30N4O5
Mol. Mass.430.4974
SMILESONC(=O)[C@H]1CC(CN[C@@H]1C(=O)N1CC[C@@H](C1)c1ccccc1)OC(=O)N1CCCC1