Reaction Details
Target72 kDa type IV collagenase
LigandBDBM50301112
Substrate/Competitorn/a
Meas. Tech.ChEMBL_598555 (CHEMBL1043547)
IC50>2000±n/a nM
Citation Li, YLShi, EBurns, DLi, YCovington, MBPan, MScherle, PFriedman, SMetcalf, BYao, W Discovery of novel selective HER-2 sheddase inhibitors through optimization of P1 moiety. Bioorg Med Chem Lett19:5037-42 (2009) 
 
72 kDa type IV collagenase
Name:72 kDa type IV collagenase
Type:Enzyme
Mol. Mass.:73870.36
Organism:Homo sapiens (Human)
Description: P08253
Residue:660
BDBM50301112
NameBDBM50301112
Synonyms:(5S,6S)-5-(hydroxycarbamoyl)-6-(isoindoline-2-carbonyl)piperidin-3-yl pyrrolidine-1-carboxylate | CHEMBL586042
TypeSmall organic molecule
Emp. Form.C20H26N4O5
Mol. Mass.402.4442
SMILESONC(=O)[C@H]1CC(CN[C@@H]1C(=O)N1Cc2ccccc2C1)OC(=O)N1CCCC1