Reaction Details
TargetDisintegrin and metalloproteinase domain-containing protein 10
LigandBDBM50301107
Substrate/Competitorn/a
Meas. Tech.ChEMBL_598554 (CHEMBL1043546)
IC50 11±n/a nM
Citation Li, YLShi, EBurns, DLi, YCovington, MBPan, MScherle, PFriedman, SMetcalf, BYao, W Discovery of novel selective HER-2 sheddase inhibitors through optimization of P1 moiety. Bioorg Med Chem Lett19:5037-42 (2009) 
 
Disintegrin and metalloproteinase domain-containing protein 10
Name:Disintegrin and metalloproteinase domain-containing protein 10
Type:Enzyme
Mol. Mass.:84160.93
Organism:Homo sapiens (Human)
Description:O14672
Residue:748
BDBM50301107
NameBDBM50301107
Synonyms:CHEMBL572301 | isopropyl-(5S,6S)-5-(hydroxycarbamoyl)-6-(4-phenyl-1,2,3,6-tetrahydropyridine-1-carbonyl)piperidin-3-yl(methyl)carbamate
TypeSmall organic molecule
Emp. Form.C23H32N4O5
Mol. Mass.444.524
SMILESCC(C)OC(=O)N(C)C1CN[C@@H]([C@H](C1)C(=O)NO)C(=O)N1CCC(=CC1)c1ccccc1