Reaction Details
TargetDisintegrin and metalloproteinase domain-containing protein 10
LigandBDBM50301108
Substrate/Competitorn/a
Meas. Tech.ChEMBL_598554 (CHEMBL1043546)
IC50 99±n/a nM
Citation Li, YLShi, EBurns, DLi, YCovington, MBPan, MScherle, PFriedman, SMetcalf, BYao, W Discovery of novel selective HER-2 sheddase inhibitors through optimization of P1 moiety. Bioorg Med Chem Lett19:5037-42 (2009) 
 
Disintegrin and metalloproteinase domain-containing protein 10
Name:Disintegrin and metalloproteinase domain-containing protein 10
Type:Enzyme
Mol. Mass.:84160.93
Organism:Homo sapiens (Human)
Description:O14672
Residue:748
BDBM50301108
NameBDBM50301108
Synonyms:(5S,6S)-5-(hydroxycarbamoyl)-6-(4-phenylpiperidine-1-carbonyl)piperidin-3-yl pyrrolidine-1-carboxylate | CHEMBL584120
TypeSmall organic molecule
Emp. Form.C23H32N4O5
Mol. Mass.444.524
SMILESONC(=O)[C@H]1C[C@@H](CN[C@@H]1C(=O)N1CCC(CC1)c1ccccc1)OC(=O)N1CCCC1