Reaction Details
TargetDisintegrin and metalloproteinase domain-containing protein 10
LigandBDBM50301112
Substrate/Competitorn/a
Meas. Tech.ChEMBL_598554 (CHEMBL1043546)
IC50 186±n/a nM
Citation Li, YLShi, EBurns, DLi, YCovington, MBPan, MScherle, PFriedman, SMetcalf, BYao, W Discovery of novel selective HER-2 sheddase inhibitors through optimization of P1 moiety. Bioorg Med Chem Lett19:5037-42 (2009) 
 
Disintegrin and metalloproteinase domain-containing protein 10
Name:Disintegrin and metalloproteinase domain-containing protein 10
Type:Enzyme
Mol. Mass.:84160.93
Organism:Homo sapiens (Human)
Description:O14672
Residue:748
BDBM50301112
NameBDBM50301112
Synonyms:(5S,6S)-5-(hydroxycarbamoyl)-6-(isoindoline-2-carbonyl)piperidin-3-yl pyrrolidine-1-carboxylate | CHEMBL586042
TypeSmall organic molecule
Emp. Form.C20H26N4O5
Mol. Mass.402.4442
SMILESONC(=O)[C@H]1CC(CN[C@@H]1C(=O)N1Cc2ccccc2C1)OC(=O)N1CCCC1