Reaction Details
TargetDisintegrin and metalloproteinase domain-containing protein 10
LigandBDBM50301120
Substrate/Competitorn/a
Meas. Tech.ChEMBL_598554 (CHEMBL1043546)
IC50 26±n/a nM
Citation Li, YLShi, EBurns, DLi, YCovington, MBPan, MScherle, PFriedman, SMetcalf, BYao, W Discovery of novel selective HER-2 sheddase inhibitors through optimization of P1 moiety. Bioorg Med Chem Lett19:5037-42 (2009) 
 
Disintegrin and metalloproteinase domain-containing protein 10
Name:Disintegrin and metalloproteinase domain-containing protein 10
Type:Enzyme
Mol. Mass.:84160.93
Organism:Homo sapiens (Human)
Description:O14672
Residue:748
BDBM50301120
NameBDBM50301120
Synonyms:(3S,5S,6S)-5-(hydroxycarbamoyl)-1-methyl-6-(4-phenylpiperazine-1-carbonyl)piperidin-3-yl azocane-1-carboxylate | CHEMBL572045
TypeSmall organic molecule
Emp. Form.C26H39N5O5
Mol. Mass.501.6184
SMILESCN1C[C@H](C[C@@H]([C@H]1C(=O)N1CCN(CC1)c1ccccc1)C(=O)NO)OC(=O)N1CCCCCCC1