Reaction Details
Target72 kDa type IV collagenase
LigandBDBM50301101
Substrate/Competitorn/a
Meas. Tech.ChEMBL_598555 (CHEMBL1043547)
IC50 365±n/a nM
Citation Li, YLShi, EBurns, DLi, YCovington, MBPan, MScherle, PFriedman, SMetcalf, BYao, W Discovery of novel selective HER-2 sheddase inhibitors through optimization of P1 moiety. Bioorg Med Chem Lett19:5037-42 (2009) 
 
72 kDa type IV collagenase
Name:72 kDa type IV collagenase
Type:Enzyme
Mol. Mass.:73870.36
Organism:Homo sapiens (Human)
Description: P08253
Residue:660
BDBM50301101
NameBDBM50301101
Synonyms:(2S,3S)-N-hydroxy-5-(2-oxo-2-(pyrrolidin-1-yl)ethyl)-2-((R)-3-phenylpyrrolidine-1-carbonyl)piperidine-3-carboxamide | CHEMBL576061
TypeSmall organic molecule
Emp. Form.C23H32N4O4
Mol. Mass.428.5246
SMILESONC(=O)[C@H]1CC(CC(=O)N2CCCC2)CN[C@@H]1C(=O)N1CC[C@@H](C1)c1ccccc1