Reaction Details
TargetReceptor tyrosine-protein kinase erbB-2
LigandBDBM50301121
Substrate/Competitorn/a
Meas. Tech.ChEMBL_598553 (CHEMBL1043545)
IC50 30±n/a nM
Citation Li, YLShi, EBurns, DLi, YCovington, MBPan, MScherle, PFriedman, SMetcalf, BYao, W Discovery of novel selective HER-2 sheddase inhibitors through optimization of P1 moiety. Bioorg Med Chem Lett19:5037-42 (2009) 
 
Receptor tyrosine-protein kinase erbB-2
Name:Receptor tyrosine-protein kinase erbB-2
Type:n/a
Mol. Mass.:137894.47
Organism:Homo sapiens (Human)
Description:P04626
Residue:1255
BDBM50301121
NameBDBM50301121
Synonyms:(3R,5S,6S)-5-(hydroxycarbamoyl)-6-(4-phenyl-1,2,3,6-tetrahydropyridine-1-carbonyl)piperidin-3-yl pyrrolidine-1-carboxylate | CHEMBL585304
TypeSmall organic molecule
Emp. Form.C23H30N4O5
Mol. Mass.442.5081
SMILESONC(=O)[C@H]1C[C@H](CN[C@@H]1C(=O)N1CCC(=CC1)c1ccccc1)OC(=O)N1CCCC1