Reaction Details
Target72 kDa type IV collagenase
LigandBDBM50301105
Substrate/Competitorn/a
Meas. Tech.ChEMBL_598555 (CHEMBL1043547)
IC50 11±n/a nM
Citation Li, YLShi, EBurns, DLi, YCovington, MBPan, MScherle, PFriedman, SMetcalf, BYao, W Discovery of novel selective HER-2 sheddase inhibitors through optimization of P1 moiety. Bioorg Med Chem Lett19:5037-42 (2009) 
 
72 kDa type IV collagenase
Name:72 kDa type IV collagenase
Type:Enzyme
Mol. Mass.:73870.36
Organism:Homo sapiens (Human)
Description: P08253
Residue:660
BDBM50301105
NameBDBM50301105
Synonyms:(2S,3S)-N-hydroxy-5-(N-methylisobutyramido)-2-(4-phenyl-1,2,3,6-tetrahydropyridine-1-carbonyl)piperidine-3-carboxamide | CHEMBL569853
TypeSmall organic molecule
Emp. Form.C23H32N4O4
Mol. Mass.428.5246
SMILESCC(C)C(=O)N(C)C1CN[C@@H]([C@H](C1)C(=O)NO)C(=O)N1CCC(=CC1)c1ccccc1