Reaction Details
Target72 kDa type IV collagenase
LigandBDBM50301117
Substrate/Competitorn/a
Meas. Tech.ChEMBL_598555 (CHEMBL1043547)
IC50>2000±n/a nM
Citation Li, YLShi, EBurns, DLi, YCovington, MBPan, MScherle, PFriedman, SMetcalf, BYao, W Discovery of novel selective HER-2 sheddase inhibitors through optimization of P1 moiety. Bioorg Med Chem Lett19:5037-42 (2009) 
 
72 kDa type IV collagenase
Name:72 kDa type IV collagenase
Type:Enzyme
Mol. Mass.:73870.36
Organism:Homo sapiens (Human)
Description: P08253
Residue:660
BDBM50301117
NameBDBM50301117
Synonyms:(3S,5S,6S)-5-(hydroxycarbamoyl)-1-methyl-6-(4-phenylpiperazine-1-carbonyl)piperidin-3-yl 3,3-difluoropyrrolidine-1-carboxylate | CHEMBL569389
TypeSmall organic molecule
Emp. Form.C23H31F2N5O5
Mol. Mass.495.5195
SMILESCN1C[C@H](C[C@@H]([C@H]1C(=O)N1CCN(CC1)c1ccccc1)C(=O)NO)OC(=O)N1CCC(F)(F)C1