Reaction Details
TargetInterstitial collagenase
LigandBDBM50301115
Substrate/Competitorn/a
Meas. Tech.ChEMBL_598556 (CHEMBL1043548)
IC50>5000±n/a nM
Citation Li, YLShi, EBurns, DLi, YCovington, MBPan, MScherle, PFriedman, SMetcalf, BYao, W Discovery of novel selective HER-2 sheddase inhibitors through optimization of P1 moiety. Bioorg Med Chem Lett19:5037-42 (2009) 
 
Interstitial collagenase
Name:Interstitial collagenase
Type:Enzyme
Mol. Mass.:54010.26
Organism:Homo sapiens (Human)
Description: P03956
Residue:469
BDBM50301115
NameBDBM50301115
Synonyms:(3S,5S,6S)-5-(hydroxycarbamoyl)-1-methyl-6-(4-phenylpiperazine-1-carbonyl)piperidin-3-yl dimethylcarbamate | CHEMBL567940
TypeSmall organic molecule
Emp. Form.C21H31N5O5
Mol. Mass.433.5013
SMILESCN(C)C(=O)O[C@H]1C[C@@H]([C@H](N(C)C1)C(=O)N1CCN(CC1)c1ccccc1)C(=O)NO