Reaction Details
TargetStromelysin-1
LigandBDBM50301109
Substrate/Competitorn/a
Meas. Tech.ChEMBL_598557 (CHEMBL1043549)
IC50>5000±n/a nM
Citation Li, YLShi, EBurns, DLi, YCovington, MBPan, MScherle, PFriedman, SMetcalf, BYao, W Discovery of novel selective HER-2 sheddase inhibitors through optimization of P1 moiety. Bioorg Med Chem Lett19:5037-42 (2009) 
 
Stromelysin-1
Name:Stromelysin-1
Type:Enzyme
Mol. Mass.:53973.13
Organism:Homo sapiens (Human)
Description: P08254
Residue:477
BDBM50301109
NameBDBM50301109
Synonyms:(5S,6S)-5-(hydroxycarbamoyl)-6-(4-phenylpiperazine-1-carbonyl)piperidin-3-yl pyrrolidine-1-carboxylate | CHEMBL566233
TypeSmall organic molecule
Emp. Form.C22H31N5O5
Mol. Mass.445.512
SMILESONC(=O)[C@H]1C[C@@H](CN[C@@H]1C(=O)N1CCN(CC1)c1ccccc1)OC(=O)N1CCCC1