Reaction Details
TargetStromelysin-1
LigandBDBM50301116
Substrate/Competitorn/a
Meas. Tech.ChEMBL_598557 (CHEMBL1043549)
IC50 5000±n/a nM
Citation Li, YLShi, EBurns, DLi, YCovington, MBPan, MScherle, PFriedman, SMetcalf, BYao, W Discovery of novel selective HER-2 sheddase inhibitors through optimization of P1 moiety. Bioorg Med Chem Lett19:5037-42 (2009) 
 
Stromelysin-1
Name:Stromelysin-1
Type:Enzyme
Mol. Mass.:53973.13
Organism:Homo sapiens (Human)
Description: P08254
Residue:477
BDBM50301116
NameBDBM50301116
Synonyms:(3S,5S,6S)-5-(hydroxycarbamoyl)-1-methyl-6-(4-phenylpiperazine-1-carbonyl)piperidin-3-yl 2,5-dihydro-1H-pyrrole-1-carboxylate | CHEMBL572091
TypeSmall organic molecule
Emp. Form.C23H31N5O5
Mol. Mass.457.5227
SMILESCN1C[C@H](C[C@@H]([C@H]1C(=O)N1CCN(CC1)c1ccccc1)C(=O)NO)OC(=O)N1CC=CC1