Reaction Details
TargetMatrix metalloproteinase-9
LigandBDBM50301114
Substrate/Competitorn/a
Meas. Tech.ChEMBL_598558 (CHEMBL1043550)
IC50>5000±n/a nM
Citation Li, YLShi, EBurns, DLi, YCovington, MBPan, MScherle, PFriedman, SMetcalf, BYao, W Discovery of novel selective HER-2 sheddase inhibitors through optimization of P1 moiety. Bioorg Med Chem Lett19:5037-42 (2009) 
 
Matrix metalloproteinase-9
Name:Matrix metalloproteinase-9
Type:Enzyme
Mol. Mass.:78452.28
Organism:Homo sapiens (Human)
Description:P14780
Residue:707
BDBM50301114
NameBDBM50301114
Synonyms:(2S,3S,5S)-methyl 3-(hydroxycarbamoyl)-2-(4-phenylpiperazine-1-carbonyl)-5-(pyrrolidine-1-carbonyloxy)piperidine-1-carboxylate | CHEMBL585886
TypeSmall organic molecule
Emp. Form.C24H33N5O7
Mol. Mass.503.5481
SMILESCOC(=O)N1C[C@H](C[C@@H]([C@H]1C(=O)N1CCN(CC1)c1ccccc1)C(=O)NO)OC(=O)N1CCCC1