Reaction Details
TargetMatrix metalloproteinase-9
LigandBDBM50301115
Substrate/Competitorn/a
Meas. Tech.ChEMBL_598558 (CHEMBL1043550)
IC50 5000±n/a nM
Citation Li, YLShi, EBurns, DLi, YCovington, MBPan, MScherle, PFriedman, SMetcalf, BYao, W Discovery of novel selective HER-2 sheddase inhibitors through optimization of P1 moiety. Bioorg Med Chem Lett19:5037-42 (2009) 
 
Matrix metalloproteinase-9
Name:Matrix metalloproteinase-9
Type:Enzyme
Mol. Mass.:78452.28
Organism:Homo sapiens (Human)
Description:P14780
Residue:707
BDBM50301115
NameBDBM50301115
Synonyms:(3S,5S,6S)-5-(hydroxycarbamoyl)-1-methyl-6-(4-phenylpiperazine-1-carbonyl)piperidin-3-yl dimethylcarbamate | CHEMBL567940
TypeSmall organic molecule
Emp. Form.C21H31N5O5
Mol. Mass.433.5013
SMILESCN(C)C(=O)O[C@H]1C[C@@H]([C@H](N(C)C1)C(=O)N1CCN(CC1)c1ccccc1)C(=O)NO