Reaction Details
TargetDisintegrin and metalloproteinase domain-containing protein 10
LigandBDBM50301124
Substrate/Competitorn/a
Meas. Tech.ChEMBL_598554 (CHEMBL1043546)
IC50 161±n/a nM
Citation Li, YLShi, EBurns, DLi, YCovington, MBPan, MScherle, PFriedman, SMetcalf, BYao, W Discovery of novel selective HER-2 sheddase inhibitors through optimization of P1 moiety. Bioorg Med Chem Lett19:5037-42 (2009) 
 
Disintegrin and metalloproteinase domain-containing protein 10
Name:Disintegrin and metalloproteinase domain-containing protein 10
Type:Enzyme
Mol. Mass.:84160.93
Organism:Homo sapiens (Human)
Description:O14672
Residue:748
BDBM50301124
NameBDBM50301124
Synonyms:(2S,3S)-5-(2-(4-aminobutylamino)-2-oxoethyl)-N-hydroxy-2-(3-phenylpyrrolidine-1-carbonyl)piperidine-3-carboxamide | CHEMBL568356
TypeSmall organic molecule
Emp. Form.C23H35N5O4
Mol. Mass.445.5551
SMILESNCCCCNC(=O)CC1CN[C@@H]([C@H](C1)C(=O)NO)C(=O)N1CCC(C1)c1ccccc1