Reaction Details
Target72 kDa type IV collagenase
LigandBDBM50227986
Substrate/Competitorn/a
Meas. Tech.ChEMBL_598555 (CHEMBL1043547)
IC50 998±n/a nM
Citation Li, YLShi, EBurns, DLi, YCovington, MBPan, MScherle, PFriedman, SMetcalf, BYao, W Discovery of novel selective HER-2 sheddase inhibitors through optimization of P1 moiety. Bioorg Med Chem Lett19:5037-42 (2009) 
 
72 kDa type IV collagenase
Name:72 kDa type IV collagenase
Type:Enzyme
Mol. Mass.:73870.36
Organism:Homo sapiens (Human)
Description: P08253
Residue:660
BDBM50227986
NameBDBM50227986
Synonyms:(6S,7S)-6-(3-phenyl-pyrrolidine-1-carbonyl)-5-aza-spiro[2.5]octane-7-carboxylic acid hydroxyamide CHEMBL252246
TypeSmall organic molecule
Emp. Form.C19H25N3O3
Mol. Mass.343.4201
SMILESONC(=O)[C@H]1CC2(CC2)CN[C@@H]1C(=O)N1CCC(C1)c1ccccc1