Reaction Details
TargetReceptor tyrosine-protein kinase erbB-2
LigandBDBM50301101
Substrate/Competitorn/a
Meas. Tech.ChEMBL_598553 (CHEMBL1043545)
IC50 5.6±n/a nM
Citation Li, YLShi, EBurns, DLi, YCovington, MBPan, MScherle, PFriedman, SMetcalf, BYao, W Discovery of novel selective HER-2 sheddase inhibitors through optimization of P1 moiety. Bioorg Med Chem Lett19:5037-42 (2009) 
 
Receptor tyrosine-protein kinase erbB-2
Name:Receptor tyrosine-protein kinase erbB-2
Type:n/a
Mol. Mass.:137894.47
Organism:Homo sapiens (Human)
Description:P04626
Residue:1255
BDBM50301101
NameBDBM50301101
Synonyms:(2S,3S)-N-hydroxy-5-(2-oxo-2-(pyrrolidin-1-yl)ethyl)-2-((R)-3-phenylpyrrolidine-1-carbonyl)piperidine-3-carboxamide | CHEMBL576061
TypeSmall organic molecule
Emp. Form.C23H32N4O4
Mol. Mass.428.5246
SMILESONC(=O)[C@H]1CC(CC(=O)N2CCCC2)CN[C@@H]1C(=O)N1CC[C@@H](C1)c1ccccc1