Reaction Details
TargetReceptor tyrosine-protein kinase erbB-2
LigandBDBM50227986
Substrate/Competitorn/a
Meas. Tech.ChEMBL_598553 (CHEMBL1043545)
IC50 358±n/a nM
Citation Li, YLShi, EBurns, DLi, YCovington, MBPan, MScherle, PFriedman, SMetcalf, BYao, W Discovery of novel selective HER-2 sheddase inhibitors through optimization of P1 moiety. Bioorg Med Chem Lett19:5037-42 (2009) 
 
Receptor tyrosine-protein kinase erbB-2
Name:Receptor tyrosine-protein kinase erbB-2
Type:n/a
Mol. Mass.:137894.47
Organism:Homo sapiens (Human)
Description:P04626
Residue:1255
BDBM50227986
NameBDBM50227986
Synonyms:(6S,7S)-6-(3-phenyl-pyrrolidine-1-carbonyl)-5-aza-spiro[2.5]octane-7-carboxylic acid hydroxyamide CHEMBL252246
TypeSmall organic molecule
Emp. Form.C19H25N3O3
Mol. Mass.343.4201
SMILESONC(=O)[C@H]1CC2(CC2)CN[C@@H]1C(=O)N1CCC(C1)c1ccccc1