Reaction Details
TargetReceptor tyrosine-protein kinase erbB-2
LigandBDBM50301122
Substrate/Competitorn/a
Meas. Tech.ChEMBL_598553 (CHEMBL1043545)
IC50 52±n/a nM
Citation Li, YLShi, EBurns, DLi, YCovington, MBPan, MScherle, PFriedman, SMetcalf, BYao, W Discovery of novel selective HER-2 sheddase inhibitors through optimization of P1 moiety. Bioorg Med Chem Lett19:5037-42 (2009) 
 
Receptor tyrosine-protein kinase erbB-2
Name:Receptor tyrosine-protein kinase erbB-2
Type:n/a
Mol. Mass.:137894.47
Organism:Homo sapiens (Human)
Description:P04626
Residue:1255
BDBM50301122
NameBDBM50301122
Synonyms:(2S,3S)-N-hydroxy-5-(N-methylisobutyramido)-2-((R)-3-phenylpyrrolidine-1-carbonyl)piperidine-3-carboxamide | CHEMBL567939
TypeSmall organic molecule
Emp. Form.C22H32N4O4
Mol. Mass.416.5139
SMILESCC(C)C(=O)N(C)C1CN[C@@H]([C@H](C1)C(=O)NO)C(=O)N1CC[C@@H](C1)c1ccccc1