Reaction Details
TargetReceptor tyrosine-protein kinase erbB-2
LigandBDBM50301123
Substrate/Competitorn/a
Meas. Tech.ChEMBL_598553 (CHEMBL1043545)
IC50 29±n/a nM
Citation Li, YLShi, EBurns, DLi, YCovington, MBPan, MScherle, PFriedman, SMetcalf, BYao, W Discovery of novel selective HER-2 sheddase inhibitors through optimization of P1 moiety. Bioorg Med Chem Lett19:5037-42 (2009) 
 
Receptor tyrosine-protein kinase erbB-2
Name:Receptor tyrosine-protein kinase erbB-2
Type:n/a
Mol. Mass.:137894.47
Organism:Homo sapiens (Human)
Description:P04626
Residue:1255
BDBM50301123
NameBDBM50301123
Synonyms:(2S,3S)-N-hydroxy-5-(N-methylbenzamido)-2-((R)-3-phenylpyrrolidine-1-carbonyl)piperidine-3-carboxamide | CHEMBL584960
TypeSmall organic molecule
Emp. Form.C25H30N4O4
Mol. Mass.450.5301
SMILESCN(C1CN[C@@H]([C@H](C1)C(=O)NO)C(=O)N1CC[C@@H](C1)c1ccccc1)C(=O)c1ccccc1