Reaction Details
TargetReceptor tyrosine-protein kinase erbB-2
LigandBDBM50301106
Substrate/Competitorn/a
Meas. Tech.ChEMBL_598553 (CHEMBL1043545)
IC50 10±n/a nM
Citation Li, YLShi, EBurns, DLi, YCovington, MBPan, MScherle, PFriedman, SMetcalf, BYao, W Discovery of novel selective HER-2 sheddase inhibitors through optimization of P1 moiety. Bioorg Med Chem Lett19:5037-42 (2009) 
 
Receptor tyrosine-protein kinase erbB-2
Name:Receptor tyrosine-protein kinase erbB-2
Type:n/a
Mol. Mass.:137894.47
Organism:Homo sapiens (Human)
Description:P04626
Residue:1255
BDBM50301106
NameBDBM50301106
Synonyms:(2S,3S)-N-hydroxy-5-(N-methylbenzamido)-2-(4-phenyl-1,2,3,6-tetrahydropyridine-1-carbonyl)piperidine-3-carboxamide | CHEMBL570760
TypeSmall organic molecule
Emp. Form.C26H30N4O4
Mol. Mass.462.5408
SMILESCN(C1CN[C@@H]([C@H](C1)C(=O)NO)C(=O)N1CCC(=CC1)c1ccccc1)C(=O)c1ccccc1