Reaction Details
TargetReceptor tyrosine-protein kinase erbB-2
LigandBDBM50378414
Substrate/Competitorn/a
Meas. Tech.ChEMBL_598553 (CHEMBL1043545)
IC50 28±n/a nM
Citation Li, YLShi, EBurns, DLi, YCovington, MBPan, MScherle, PFriedman, SMetcalf, BYao, W Discovery of novel selective HER-2 sheddase inhibitors through optimization of P1 moiety. Bioorg Med Chem Lett19:5037-42 (2009) 
 
Receptor tyrosine-protein kinase erbB-2
Name:Receptor tyrosine-protein kinase erbB-2
Type:n/a
Mol. Mass.:137894.47
Organism:Homo sapiens (Human)
Description:P04626
Residue:1255
BDBM50378414
NameBDBM50378414
Synonyms:CHEMBL1204013
TypeSmall organic molecule
Emp. Form.C22H30N4O5
Mol. Mass.430.4974
SMILESONC(=O)[C@H]1CC(CN[C@@H]1C(=O)N1CC[C@@H](C1)c1ccccc1)OC(=O)N1CCCC1