Reaction Details
TargetReceptor tyrosine-protein kinase erbB-2
LigandBDBM50301114
Substrate/Competitorn/a
Meas. Tech.ChEMBL_598553 (CHEMBL1043545)
IC50 8.1±n/a nM
Citation Li, YLShi, EBurns, DLi, YCovington, MBPan, MScherle, PFriedman, SMetcalf, BYao, W Discovery of novel selective HER-2 sheddase inhibitors through optimization of P1 moiety. Bioorg Med Chem Lett19:5037-42 (2009) 
 
Receptor tyrosine-protein kinase erbB-2
Name:Receptor tyrosine-protein kinase erbB-2
Type:n/a
Mol. Mass.:137894.47
Organism:Homo sapiens (Human)
Description:P04626
Residue:1255
BDBM50301114
NameBDBM50301114
Synonyms:(2S,3S,5S)-methyl 3-(hydroxycarbamoyl)-2-(4-phenylpiperazine-1-carbonyl)-5-(pyrrolidine-1-carbonyloxy)piperidine-1-carboxylate | CHEMBL585886
TypeSmall organic molecule
Emp. Form.C24H33N5O7
Mol. Mass.503.5481
SMILESCOC(=O)N1C[C@H](C[C@@H]([C@H]1C(=O)N1CCN(CC1)c1ccccc1)C(=O)NO)OC(=O)N1CCCC1