Reaction Details
TargetReceptor tyrosine-protein kinase erbB-2
LigandBDBM50301118
Substrate/Competitorn/a
Meas. Tech.ChEMBL_598553 (CHEMBL1043545)
IC50 7.3±n/a nM
Citation Li, YLShi, EBurns, DLi, YCovington, MBPan, MScherle, PFriedman, SMetcalf, BYao, W Discovery of novel selective HER-2 sheddase inhibitors through optimization of P1 moiety. Bioorg Med Chem Lett19:5037-42 (2009) 
 
Receptor tyrosine-protein kinase erbB-2
Name:Receptor tyrosine-protein kinase erbB-2
Type:n/a
Mol. Mass.:137894.47
Organism:Homo sapiens (Human)
Description:P04626
Residue:1255
BDBM50301118
NameBDBM50301118
Synonyms:(3S,5S,6S)-5-(hydroxycarbamoyl)-1-methyl-6-(4-phenylpiperazine-1-carbonyl)piperidin-3-yl piperidine-1-carboxylate | CHEMBL584116
TypeSmall organic molecule
Emp. Form.C24H35N5O5
Mol. Mass.473.5652
SMILESCN1C[C@H](C[C@@H]([C@H]1C(=O)N1CCN(CC1)c1ccccc1)C(=O)NO)OC(=O)N1CCCCC1