Reaction Details
TargetDisintegrin and metalloproteinase domain-containing protein 10
LigandBDBM50203533
Substrate/Competitorn/a
Meas. Tech.ChEMBL_598554 (CHEMBL1043546)
IC50 97±n/a nM
Citation Li, YLShi, EBurns, DLi, YCovington, MBPan, MScherle, PFriedman, SMetcalf, BYao, W Discovery of novel selective HER-2 sheddase inhibitors through optimization of P1 moiety. Bioorg Med Chem Lett19:5037-42 (2009) 
 
Disintegrin and metalloproteinase domain-containing protein 10
Name:Disintegrin and metalloproteinase domain-containing protein 10
Type:Enzyme
Mol. Mass.:84160.93
Organism:Homo sapiens (Human)
Description:O14672
Residue:748
BDBM50203533
NameBDBM50203533
Synonyms:(6S,7S)-N-hydroxy-6-((R)-3-phenylpyrrolidine-1-carbonyl)-5-azaspiro[2.5]octane-7-carboxamide CHEMBL221698
TypeSmall organic molecule
Emp. Form.C19H25N3O3
Mol. Mass.343.4201
SMILESONC(=O)[C@H]1CC2(CC2)CN[C@@H]1C(=O)N1CC[C@@H](C1)c1ccccc1